[Freeswitch-users] Make fails on Mac OS X

Ivan C Myrvold ivan at myrvold.org
Sat May 12 02:10:36 PDT 2007

Checking out the newest svn, running

It fails on doing the make on my MacBook Pro. I checked out the svn  
one week ago on the same machine with no problems at all.

Here are the last few lines of make:

Making all in .
mkdir .libs
Compiling src/switch_apr.c ...
cc1: warnings being treated as errors
src/switch_apr.c: In function 'switch_vasprintf':
src/switch_apr.c:656: warning: implicit declaration of function  
make[2]: *** [libfreeswitch_la-switch_apr.lo] Error 1
make[1]: *** [all-recursive] Error 1
make: *** [all] Error 2
OpenPBX:~/Documents/Freeswitch/freeswitch.12-05-07 imyrvold$


More information about the FreeSWITCH-users mailing list