[Freeswitch-dev] the Compile Failure for FreeSWITCH

Mizuki Tashiro mzktashiro at h8.dion.ne.jp
Tue Aug 1 11:23:16 EDT 2006

Dear FreeSWITCH guys!

I tried to compile the FreeSWITCH, but failed.
I compiled as the below URL instruction.

At the end of compiling, the following message has been

creating freeswitch
creating fsxs
cd . && /bin/sh
/usr/local/snapshot_freeswitch/build/config/missing --run
configure.in:7: error: Autoconf version 2.58 or higher is
aclocal.m4:6426: AM_INIT_AUTOMAKE is expanded from...
configure.in:7: the top level
autom4te: /usr/bin/m4 failed with exit status: 1
autoheader: /usr/bin/autom4te failed with exit status: 1
gmake[2]: *** [src/include/switch_am_config.h.in] Error 1
gmake[2]: Exit Directory `/usr/local/snapshot_freeswitch'
gmake[1]: *** [install-recursive] Error 1
gmake[1]: Exit Directory `/usr/local/snapshot_freeswitch'
make: *** [install] Error 2

I guess that the very primary error has been occurred on
the final step for the creating freeswitch binary.
Could you please advise me for fixing it?

Thanks in advance and Best Regards,
Mizuki Tashiro

More information about the Freeswitch-dev mailing list